{"text_format":"1","workbook":"xlsx","n_sheets":5,"sheets":["Sender","Recipient","Original","As Is","Several Options"],"not_rendered":{"charts":0,"images":0,"macros":1,"external_links":0,"defined_names":5,"comments":0,"pivot_tables":0},"unopened":[],"bounds":{"document_bytes":16777216,"sheet_cells":100000,"rows_first":2000,"rows_last":500,"rows_between":2000,"halvings":0,"cell_chars":16384,"cell_head_chars":4096},"cells_cut":0,"cells_raw":0,"read":"whole","date_system":"1900"}

{"sheet":"Sender","index":0,"n_rows":2,"n_cols":2,"rows_kept":2,"cut":false,"hidden":false,"merged":[]}
["Name","Contact #"]
["Your First/Last","(330)-737-1617"]

{"sheet":"Recipient","index":1,"n_rows":428,"n_cols":4,"rows_kept":428,"cut":false,"hidden":false,"merged":[]}
["Full Name","Home Owner First Name","Home Owner Last Name","Street Address"]
[{"$f":"IF(B2=\"\",\"\",B2&\" \"&C2)","v":"Jody Jones"},"Jody","Jones","123 Main St."]
["Bob Smith","Bob","Smith","abc street"]
["Sue Johnson","Sue","Johnson","xyz street"]
["John Doe","John","Doe","789 Broadway"]
[""]
[""]
[""]
[""]
[""]
[""]
[""]
[""]
[""]
[""]
[""]
[""]
[""]
[""]
[""]
[""]
[""]
[""]
[""]
[""]
[""]
[""]
[""]
[""]
[""]
[""]
[""]
[""]
[""]
[""]
[""]
[""]
[""]
[""]
[""]
[""]
[""]
[""]
[""]
[""]
[""]
[""]
[""]
[""]
[""]
[""]
[""]
[""]
[""]
[""]
[""]
[""]
[""]
[""]
[""]
[""]
[""]
[""]
[""]
[""]
[{"$f":"IF(B66=\"\",\"\",B66&\" \"&C66)","v":""}]
[""]
[""]
[""]
[""]
[""]
[""]
[""]
[""]
[""]
[""]
[""]
[""]
[""]
[""]
[""]
[""]
[""]
[""]
[""]
[""]
[""]
[""]
[""]
[""]
[""]
[""]
[""]
[""]
[""]
[""]
[""]
[""]
[""]
[""]
[""]
[""]
[""]
[""]
[""]
[""]
[""]
[""]
[""]
[""]
[""]
[""]
[""]
[""]
[""]
[""]
[""]
[""]
[""]
[""]
[""]
[""]
[""]
[""]
[""]
[""]
[""]
[""]
[""]
[{"$f":"IF(B130=\"\",\"\",B130&\" \"&C130)","v":""}]
[""]
[""]
[""]
[""]
[""]
[""]
[""]
[""]
[""]
[""]
[""]
[""]
[""]
[""]
[""]
[""]
[""]
[""]
[""]
[""]
[""]
[""]
[""]
[""]
[""]
[""]
[""]
[""]
[""]
[""]
[""]
[""]
[""]
[""]
[""]
[""]
[""]
[""]
[""]
[""]
[""]
[""]
[""]
[""]
[""]
[""]
[""]
[""]
[""]
[""]
[""]
[""]
[""]
[""]
[""]
[""]
[""]
[""]
[""]
[""]
[""]
[""]
[""]
[{"$f":"IF(B194=\"\",\"\",B194&\" \"&C194)","v":""}]
[""]
[""]
[""]
[""]
[""]
[""]
[""]
[""]
[""]
[""]
[""]
[""]
[""]
[""]
[""]
[""]
[""]
[""]
[""]
[""]
[""]
[""]
[""]
[""]
[""]
[""]
[""]
[""]
[""]
[""]
[""]
[""]
[""]
[""]
[""]
[""]
[""]
[""]
[""]
[""]
[""]
[""]
[""]
[""]
[""]
[""]
[""]
[""]
[""]
[""]
[""]
[""]
[""]
[""]
[""]
[""]
[""]
[""]
[""]
[""]
[""]
[""]
[""]
[{"$f":"IF(B258=\"\",\"\",B258&\" \"&C258)","v":""}]
[""]
[""]
[""]
[""]
[""]
[""]
[""]
[""]
[""]
[""]
[""]
[""]
[""]
[""]
[""]
[""]
[""]
[""]
[""]
[""]
[""]
[""]
[""]
[""]
[""]
[""]
[""]
[""]
[""]
[""]
[""]
[""]
[""]
[""]
[""]
[""]
[""]
[""]
[""]
[""]
[""]
[""]
[""]
[""]
[""]
[""]
[""]
[""]
[""]
[""]
[""]
[""]
[""]
[""]
[""]
[""]
[""]
[""]
[""]
[""]
[""]
[""]
[""]
[{"$f":"IF(B322=\"\",\"\",B322&\" \"&C322)","v":""}]
[""]
[""]
[""]
[""]
[""]
[""]
[""]
[""]
[""]
[""]
[""]
[""]
[""]
[""]
[""]
[""]
[""]
[""]
[""]
[""]
[""]
[""]
[""]
[""]
[""]
[""]
[""]
[""]
[""]
[""]
[""]
[""]
[""]
[""]
[""]
[""]
[""]
[""]
[""]
[""]
[""]
[""]
[""]
[""]
[""]
[""]
[""]
[""]
[""]
[""]
[""]
[""]
[""]
[""]
[""]
[""]
[""]
[""]
[""]
[""]
[""]
[""]
[""]
[{"$f":"IF(B386=\"\",\"\",B386&\" \"&C386)","v":""}]
[""]
[""]
[""]
[""]
[""]
[""]
[""]
[""]
[""]
[""]
[""]
[""]
[""]
[""]
{"$rows_left_out":29}
{"sheet":"Original","index":2,"n_rows":16,"n_cols":13,"rows_kept":16,"cut":false,"hidden":false,"merged":[[3,0,3,7],[12,0,12,7],[13,0,13,7],[14,0,14,7],[15,0,15,7],[4,0,4,7],[6,0,6,7],[7,0,7,7],[8,0,8,7],[9,0,9,7],[10,0,10,7],[5,0,5,7]]}
[null,null,null,null,null,null,null,null,null,null,null,"Recipient","Jody Jones"]
[{"$f":"TODAY()","v":"2020-02-14"}]
[null,null,null,null,null,null,null,null,null,null,null,"Sender","Your First/Last"]
[{"$f":"\"Dear\"&\" \"&IF(ISERROR(VLOOKUP($M$1,Recipient!$A$2:$D$502,2,0)),\"\",VLOOKUP($M$1,Recipient!$A$2:$D$502,2,0))","v":"Dear Jody"}]
[{"$f":"\"     Hi, my name is \"&IF(OR(ISERROR($M$3),$M$3=\"\"),\"\",$M$3)&\". My\"","v":"     Hi, my name is Your First/Last. My"}]
["cousin Chris and I would like to"]
["$ BUY $"]
["Your house at:"]
[{"$f":"IF(ISERROR(VLOOKUP($M$1,Recipient!$A$2:$D$502,4,0)),\"\",VLOOKUP($M$1,Recipient!$A$2:$D$502,4,0))","v":"123 Main St."}]
["Please call us at"]
[{"$f":"IF(ISERROR(VLOOKUP($M$3,Sender!$A$2:$B$502,2,0)),\"\",VLOOKUP($M$3,Sender!$A$2:$B$502,2,0))","v":"(330)-737-1617"}]
[]
[]
["Please Call"]
["Thanks"]
[{"$f":"IF(OR(ISERROR($M$3),$M$3=\"\"),\"\",$M$3)","v":"Your First/Last"}]

{"sheet":"As Is","index":3,"n_rows":18,"n_cols":13,"rows_kept":18,"cut":false,"hidden":false,"merged":[[3,0,3,7],[15,0,15,7],[16,0,16,7],[17,0,17,7],[10,0,10,7],[4,0,4,7],[7,0,7,7],[5,0,5,7],[13,0,13,7],[14,0,14,7],[8,0,8,7],[9,0,9,7]]}
[null,null,null,null,null,null,null,null,null,null,null,"Recipient","Bob Smith"]
[{"$f":"TODAY()","v":"2020-02-14"}]
[null,null,null,null,null,null,null,null,null,null,null,"Sender","Your First/Last"]
[{"$f":"\"Dear\"&\" \"&IF(ISERROR(VLOOKUP($M$1,Recipient!$A$2:$D$502,2,0)),\"\",VLOOKUP($M$1,Recipient!$A$2:$D$502,2,0))","v":"Dear Bob"}]
["     I am interested in purchasing your house at "]
[{"$f":"IF(ISERROR(VLOOKUP($M$1,Recipient!$A$2:$D$502,4,0)),\"\",VLOOKUP($M$1,Recipient!$A$2:$D$502,4,0))","v":"abc street"}]
[]
["     I can buy your house ‘AS IS’ so you won’t"]
["have to fix anything up, and I have cash so I can"]
["close quickly. To discuss your options, please call "]
[{"$f":"\"me at\"&\" \"&IF(ISERROR(VLOOKUP($M$3,Sender!$A$2:$E$502,2,0)),\"\",VLOOKUP($M$3,Sender!$A$2:$E$502,2,0))","v":"me at (330)-737-1617"}]
[]
[]
["Please call!"]
[]
[]
["Thanks"]
[{"$f":"IF(OR(ISERROR($M$3),$M$3=\"\"),\"\",$M$3)","v":"Your First/Last"}]

{"sheet":"Several Options","index":4,"n_rows":19,"n_cols":13,"rows_kept":19,"cut":false,"hidden":false,"merged":[[4,0,4,7],[16,0,16,7],[17,0,17,7],[18,0,18,7],[5,0,5,7],[9,0,9,7],[10,0,10,7],[14,0,14,7],[6,0,6,7],[7,0,7,7],[11,0,11,7]]}
[null,null,null,null,null,null,null,null,null,null,null,"Recipient","John Doe"]
[{"$f":"TODAY()","v":"2020-02-14"}]
[null,null,null,null,null,null,null,null,null,null,null,"Sender","Your First/Last"]
[]
[{"$f":"\"Dear\"&\" \"&IF(ISERROR(VLOOKUP($M$1,Recipient!$A$2:$D$502,2,0)),\"\",VLOOKUP($M$1,Recipient!$A$2:$D$502,2,0))","v":"Dear John"}]
[{"$f":"\"     Hi, my name is \"&IF(OR(ISERROR($M$3),$M$3=\"\"),\"\",$M$3)&\" and I\"","v":"     Hi, my name is Your First/Last and I"}]
[{"$f":"\"am interested in purchasing your house at \"","v":"am interested in purchasing your house at "}]
[{"$f":"IF(ISERROR(VLOOKUP($M$1,Recipient!$A$2:$D$502,4,0)),\"\",VLOOKUP($M$1,Recipient!$A$2:$D$502,4,0))","v":"789 Broadway"}]
[]
[{"$f":"\"     There are several options available for people\"","v":"     There are several options available for people"}]
[{"$f":"\"who are thinking of selling. To discuss your\"","v":"who are thinking of selling. To discuss your"}]
[{"$f":"\"options, please call me at \"&IF(ISERROR(VLOOKUP($M$3,Sender!$A$2:$B$502,2,0)),\"\",VLOOKUP($M$3,Sender!$A$2:$B$502,2,0))","v":"options, please call me at (330)-737-1617"}]
[]
[]
["Please call!"]
[]
[]
["Thanks"]
[{"$f":"IF(OR(ISERROR($M$3),$M$3=\"\"),\"\",$M$3)","v":"Your First/Last"}]